Reaction Details
TargetTyrosine-protein kinase Mer
LigandBDBM50201042
Substrate/Competitorn/a
Meas. Tech.ChEMBL_1622927 (CHEMBL3865279)
EC50>1000±n/a nM
Citation Wang, XLiu, JZhang, WStashko, MANichols, JMiley, MJNorris-Drouin, JChen, ZMachius, MDeRyckere, DWood, EGraham, DKEarp, HSKireev, DFrye, SV Design and Synthesis of Novel Macrocyclic Mer Tyrosine Kinase Inhibitors. ACS Med Chem Lett7:1044-1049 (2016) 
 
Tyrosine-protein kinase Mer
Name:Tyrosine-protein kinase Mer
Type:PROTEIN
Mol. Mass.:110234.77
Organism:Homo sapiens (Human)
Description:ChEMBL_1498723
Residue:999
BDBM50201042
NameBDBM50201042
Synonyms:CHEMBL3955697
TypeSmall organic molecule
Emp. Form.C24H32N4O
Mol. Mass.392.5371
SMILESOC1CCCCCCCNc2ncc3c(cn(CCCC1)c3n2)-c1ccccc1