Reaction Details
TargetTyrosine-protein kinase Mer
LigandBDBM50201167
Substrate/Competitorn/a
Meas. Tech.ChEMBL_1622927 (CHEMBL3865279)
EC50>1000±n/a nM
Citation Wang, XLiu, JZhang, WStashko, MANichols, JMiley, MJNorris-Drouin, JChen, ZMachius, MDeRyckere, DWood, EGraham, DKEarp, HSKireev, DFrye, SV Design and Synthesis of Novel Macrocyclic Mer Tyrosine Kinase Inhibitors. ACS Med Chem Lett7:1044-1049 (2016) 
 
Tyrosine-protein kinase Mer
Name:Tyrosine-protein kinase Mer
Type:PROTEIN
Mol. Mass.:110234.77
Organism:Homo sapiens (Human)
Description:ChEMBL_1498723
Residue:999
BDBM50201167
NameBDBM50201167
Synonyms:CHEMBL3973561
TypeSmall organic molecule
Emp. Form.C27H38N8O
Mol. Mass.490.6436
SMILESCN1CCN(Cc2ccc(cc2)-c2cn3CCC[C@H](N)C(=O)NCCCCNc4ncc2c3n4)CC1