Reaction Details
TargetReceptor-type tyrosine-protein kinase FLT3
LigandBDBM50201151
Substrate/Competitorn/a
Meas. Tech.ChEMBL_1622926 (CHEMBL3865278)
IC50 8.9±n/a nM
Citation Wang, XLiu, JZhang, WStashko, MANichols, JMiley, MJNorris-Drouin, JChen, ZMachius, MDeRyckere, DWood, EGraham, DKEarp, HSKireev, DFrye, SV Design and Synthesis of Novel Macrocyclic Mer Tyrosine Kinase Inhibitors. ACS Med Chem Lett7:1044-1049 (2016) 
 
Receptor-type tyrosine-protein kinase FLT3
Name:Receptor-type tyrosine-protein kinase FLT3
Type:Enzyme
Mol. Mass.:112888.62
Organism:Homo sapiens (Human)
Description:P36888
Residue:993
BDBM50201151
NameBDBM50201151
Synonyms:CHEMBL3948030
TypeSmall organic molecule
Emp. Form.C30H44N6O
Mol. Mass.504.71
SMILESCN1CCN(Cc2ccc(cc2)-c2cn3CCCC(O)CCCCCCCCNc4ncc2c3n4)CC1