Reaction Details
TargetTyrosine-protein kinase Mer
LigandBDBM50201168
Substrate/Competitorn/a
Meas. Tech.ChEMBL_1622920 (CHEMBL3865272)
IC50 13±n/a nM
Citation Wang, XLiu, JZhang, WStashko, MANichols, JMiley, MJNorris-Drouin, JChen, ZMachius, MDeRyckere, DWood, EGraham, DKEarp, HSKireev, DFrye, SV Design and Synthesis of Novel Macrocyclic Mer Tyrosine Kinase Inhibitors. ACS Med Chem Lett7:1044-1049 (2016) 
 
Tyrosine-protein kinase Mer
Name:Tyrosine-protein kinase Mer
Type:PROTEIN
Mol. Mass.:110234.77
Organism:Homo sapiens (Human)
Description:ChEMBL_1498723
Residue:999
BDBM50201168
NameBDBM50201168
Synonyms:CHEMBL3932605
TypeSmall organic molecule
Emp. Form.C23H31N5O
Mol. Mass.393.5251
SMILESOC1CCCCCCCNc2ncc3c(cn(CCCC1)c3n2)-c1cccnc1