Reaction Details
TargetTyrosine-protein kinase Mer
LigandBDBM50201178
Substrate/Competitorn/a
Meas. Tech.ChEMBL_1622920 (CHEMBL3865272)
IC50 11±n/a nM
Citation Wang, XLiu, JZhang, WStashko, MANichols, JMiley, MJNorris-Drouin, JChen, ZMachius, MDeRyckere, DWood, EGraham, DKEarp, HSKireev, DFrye, SV Design and Synthesis of Novel Macrocyclic Mer Tyrosine Kinase Inhibitors. ACS Med Chem Lett7:1044-1049 (2016) 
 
Tyrosine-protein kinase Mer
Name:Tyrosine-protein kinase Mer
Type:PROTEIN
Mol. Mass.:110234.77
Organism:Homo sapiens (Human)
Description:ChEMBL_1498723
Residue:999
BDBM50201178
NameBDBM50201178
Synonyms:CHEMBL3963528
TypeSmall organic molecule
Emp. Form.C28H39N5O4S
Mol. Mass.541.705
SMILESOC1CCCCCCCNc2ncc3c(cn(CCCC1)c3n2)-c1ccc(cc1)S(=O)(=O)N1CCOCC1