Reaction Details
TargetTyrosine-protein kinase receptor UFO
LigandBDBM50201078
Substrate/Competitorn/a
Meas. Tech.ChEMBL_1622921 (CHEMBL3865273)
IC50 4.2±n/a nM
Citation Wang, XLiu, JZhang, WStashko, MANichols, JMiley, MJNorris-Drouin, JChen, ZMachius, MDeRyckere, DWood, EGraham, DKEarp, HSKireev, DFrye, SV Design and Synthesis of Novel Macrocyclic Mer Tyrosine Kinase Inhibitors. ACS Med Chem Lett7:1044-1049 (2016) 
 
Tyrosine-protein kinase receptor UFO
Name:Tyrosine-protein kinase receptor UFO
Type:Enzyme
Mol. Mass.:98316.97
Organism:Homo sapiens (Human)
Description:P30530
Residue:894
BDBM50201078
NameBDBM50201078
Synonyms:CHEMBL3964573
TypeSmall organic molecule
Emp. Form.C32H48N8O
Mol. Mass.560.7765
SMILESCN1CCN(Cc2ccc(cc2)-c2cn3CCCC[C@H](N)C(=O)NCCCCCCCCNc4ncc2c3n4)CC1