Reaction Details
TargetReceptor-type tyrosine-protein kinase FLT3
LigandBDBM50201148
Substrate/Competitorn/a
Meas. Tech.ChEMBL_1622926 (CHEMBL3865278)
IC50 9.6±n/a nM
Citation Wang, XLiu, JZhang, WStashko, MANichols, JMiley, MJNorris-Drouin, JChen, ZMachius, MDeRyckere, DWood, EGraham, DKEarp, HSKireev, DFrye, SV Design and Synthesis of Novel Macrocyclic Mer Tyrosine Kinase Inhibitors. ACS Med Chem Lett7:1044-1049 (2016) 
 
Receptor-type tyrosine-protein kinase FLT3
Name:Receptor-type tyrosine-protein kinase FLT3
Type:Enzyme
Mol. Mass.:112888.62
Organism:Homo sapiens (Human)
Description:P36888
Residue:993
BDBM50201148
NameBDBM50201148
Synonyms:CHEMBL3946971
TypeSmall organic molecule
Emp. Form.C31H46N6O
Mol. Mass.518.7365
SMILESCN1CCN(Cc2ccc(cc2)-c2cn3CCCCCC(O)CCCCCCCNc4ncc2c3n4)CC1