Reaction Details
TargetMetabotropic glutamate receptor 5
LigandBDBM50201558
Substrate/Competitorn/a
Meas. Tech.ChEMBL_1623100 (CHEMBL3865452)
IC50 66±n/a nM
Citation Hill, MDFang, HBrown, JMMolski, TEaston, AHan, XMiller, RHill-Drzewi, MGallagher, LMatchett, MGulianello, MBalakrishnan, ABertekap, RLSantone, KSWhiterock, VJZhuo, XBronson, JJMacor, JEDegnan, AP Development of 1 ACS Med Chem Lett7:1082-1086 (2016) 
 
Metabotropic glutamate receptor 5
Name:Metabotropic glutamate receptor 5
Type:Enzyme
Mol. Mass.:132484.72
Organism:Homo sapiens (Human)
Description:n/a
Residue:1212
BDBM50201558
NameBDBM50201558
Synonyms:CHEMBL3895289
TypeSmall organic molecule
Emp. Form.C22H15ClN4
Mol. Mass.370.834
SMILESClc1cccc(c1)-c1n[nH]c2nc(-c3ccccc3)c(C#N)c(C3CC3)c12