Reaction Details
TargetMetabotropic glutamate receptor 5
LigandBDBM50156070
Substrate/Competitorn/a
Meas. Tech.ChEMBL_1623102 (CHEMBL3865454)
IC50 930±n/a nM
Citation Hill, MDFang, HBrown, JMMolski, TEaston, AHan, XMiller, RHill-Drzewi, MGallagher, LMatchett, MGulianello, MBalakrishnan, ABertekap, RLSantone, KSWhiterock, VJZhuo, XBronson, JJMacor, JEDegnan, AP Development of 1 ACS Med Chem Lett7:1082-1086 (2016) 
 
Metabotropic glutamate receptor 5
Name:Metabotropic glutamate receptor 5
Type:Enzyme
Mol. Mass.:131900.14
Organism:Rattus norvegicus (Rat)
Description:P31424
Residue:1203
BDBM50156070
NameBDBM50156070
Synonyms:CHEMBL366217 N-(4-chloro-2-((1,3-dioxoisoindolin-2-yl)methyl)phenyl)-2-hydroxybenzamide | N-[4-Chloro-2-(1,3-dioxo-1,3-dihydro-isoindol-2-ylmethyl)-phenyl]-2-hydroxy-benzamide
TypeSmall organic molecule
Emp. Form.C22H15ClN2O4
Mol. Mass.406.819
SMILESOc1ccccc1C(=O)Nc1ccc(Cl)cc1CN1C(=O)c2ccccc2C1=O