Reaction Details
TargetMetabotropic glutamate receptor 5
LigandBDBM50201541
Substrate/Competitorn/a
Meas. Tech.ChEMBL_1623102 (CHEMBL3865454)
IC50 19±n/a nM
Citation Hill, MDFang, HBrown, JMMolski, TEaston, AHan, XMiller, RHill-Drzewi, MGallagher, LMatchett, MGulianello, MBalakrishnan, ABertekap, RLSantone, KSWhiterock, VJZhuo, XBronson, JJMacor, JEDegnan, AP Development of 1 ACS Med Chem Lett7:1082-1086 (2016) 
 
Metabotropic glutamate receptor 5
Name:Metabotropic glutamate receptor 5
Type:Enzyme
Mol. Mass.:131900.14
Organism:Rattus norvegicus (Rat)
Description:P31424
Residue:1203
BDBM50201541
NameBDBM50201541
Synonyms:CHEMBL3966581
TypeSmall organic molecule
Emp. Form.C23H14ClF3N4
Mol. Mass.438.832
SMILESFc1cccc(c1)-c1nc2[nH]nc(-c3cccc(Cl)c3)c2c(C2CC(F)(F)C2)c1C#N