Reaction Details
TargetSerine/threonine-protein kinase PAK 1
LigandBDBM50201642
Substrate/Competitorn/a
Meas. Tech.ChEMBL_1623177 (CHEMBL3865529)
IC50 2.0±n/a nM
Citation McCoull, WHennessy, EJBlades, KChuaqui, CDowling, JEFerguson, ADGoldberg, FWHowe, NJones, CRKemmitt, PDLamont, GVarnes, JGWard, RAYang, B Optimization of Highly Kinase Selective Bis-anilino Pyrimidine PAK1 Inhibitors. ACS Med Chem Lett7:1118-1123 (2016) 
 
Serine/threonine-protein kinase PAK 1
Name:Serine/threonine-protein kinase PAK 1
Type:n/a
Mol. Mass.:60640.15
Organism:Homo sapiens (Human)
Description:Q13153
Residue:545
BDBM50201642
NameBDBM50201642
Synonyms:CHEMBL3942173
TypeSmall organic molecule
Emp. Form.C27H35FN6O3S
Mol. Mass.542.669
SMILESCCN(c1cc(CO)ccc1C)c1nc(Nc2ccc(N3CCN(C)CC3)c(c2)S(=O)(=O)CC)ncc1F