Reaction Details
TargetSerine/threonine-protein kinase PAK 1
LigandBDBM50201651
Substrate/Competitorn/a
Meas. Tech.ChEMBL_1623177 (CHEMBL3865529)
IC50 0.450000±n/a nM
Citation McCoull, WHennessy, EJBlades, KChuaqui, CDowling, JEFerguson, ADGoldberg, FWHowe, NJones, CRKemmitt, PDLamont, GVarnes, JGWard, RAYang, B Optimization of Highly Kinase Selective Bis-anilino Pyrimidine PAK1 Inhibitors. ACS Med Chem Lett7:1118-1123 (2016) 
 
Serine/threonine-protein kinase PAK 1
Name:Serine/threonine-protein kinase PAK 1
Type:n/a
Mol. Mass.:60640.15
Organism:Homo sapiens (Human)
Description:Q13153
Residue:545
BDBM50201651
NameBDBM50201651
Synonyms:CHEMBL3896232
TypeSmall organic molecule
Emp. Form.C27H35FN6O3S
Mol. Mass.542.669
SMILESCCS(=O)(=O)c1cc(Nc2ncc(F)c(n2)N(C)c2cc(CO)c(C)cc2C)ccc1N1CCN(C)CC1