Reaction Details
TargetHistone deacetylase 6
LigandBDBM50202000
Substrate/Competitorn/a
Meas. Tech.ChEBML_1623658
IC50 15±n/a nM
Citation Lee, HYChang, CYSu, CJHuang, HLMehndiratta, SChao, YHHsu, CMKumar, SSung, TYHuang, YZLi, YHYang, CRLiou, JP 2-(Phenylsulfonyl)quinoline N-hydroxyacrylamides as potent anticancer agents inhibiting histone deacetylase. Eur J Med Chem122:92-101 (2016) 
 
Histone deacetylase 6
Name:Histone deacetylase 6
Type:Chromatin regulator; hydrolase; repressor
Mol. Mass.:131381.51
Organism:Homo sapiens (Human)
Description:Q9UBN7
Residue:1215
BDBM50202000
NameBDBM50202000
Synonyms:CHEMBL3973951
TypeSmall organic molecule
Emp. Form.C18H14N2O4S
Mol. Mass.354.38
SMILESONC(=O)\C=C\c1cccc(c1)S(=O)(=O)c1ccc2ccccc2n1