Reaction Details
TargetBroad substrate specificity ATP-binding cassette transporter ABCG2
LigandBDBM50305083
Substrate/Competitorn/a
Meas. Tech.ChEBML_1623937
EC50 74±n/a nM
Citation Pires, ADRALecerf-Schmidt, FGuragossian, NPazinato, JGozzi, GJWinter, EValdameri, GVeale, ABoumendjel, ADi Pietro, APérès, B New, highly potent and non-toxic, chromone inhibitors of the human breast cancer resistance protein ABCG2. Eur J Med Chem122:291-301 (2016) 
 
Broad substrate specificity ATP-binding cassette transporter ABCG2
Name:Broad substrate specificity ATP-binding cassette transporter ABCG2
Type:Multi-pass membrane protein; monomer or homodimer; disulfide-linked
Mol. Mass.:72329.48
Organism:Homo sapiens (Human)
Description:Q9UNQ0
Residue:655
BDBM50305083
NameBDBM50305083
Synonyms:3-((3S,6S)-6-Isobutyl-9-methoxy-1,4-dioxo-1,2,3,4,6,7,12,12a-octahydro-pyrazino[1',2':1,6]pyrido[3,4-b]indol-3-yl)-propionic acid tert-butyl ester CHEMBL488910 Ko143 | US9695174, Ko143
TypeSmall organic molecule
Emp. Form.C26H35N3O5
Mol. Mass.469.5732
SMILESCOc1ccc2c3C[C@@H]4N([C@@H](CC(C)C)c3[nH]c2c1)C(=O)[C@H](CCC(=O)OC(C)(C)C)NC4=O