Reaction Details
TargetCannabinoid receptor 2
LigandBDBM50202516
Substrate/Competitorn/a
Meas. Tech.ChEMBL_1624520 (CHEMBL3866932)
Ki 584±n/a nM
Citation Osman, NALigresti, AKlein, CDAllarà, MRabbito, ADi Marzo, VAbouzid, KAAbadi, AH Discovery of novel Tetrahydrobenzo[b]thiophene and pyrrole based scaffolds as potent and selective CB2 receptor ligands: The structural elements controlling binding affinity, selectivity and functionality. Eur J Med Chem122:619-634 (2016) 
 
Cannabinoid receptor 2
Name:Cannabinoid receptor 2
Type:G Protein-Coupled Receptor (GPCR)
Mol. Mass.:39690.94
Organism:Homo sapiens (Human)
Description:P34972
Residue:360
BDBM50202516
NameBDBM50202516
Synonyms:CHEMBL3893062
TypeSmall organic molecule
Emp. Form.C21H22N2O
Mol. Mass.318.4122
SMILESCc1cc(C(=O)NCCc2ccccc2)c(C)n1-c1ccccc1