Reaction Details
TargetCannabinoid receptor 2
LigandBDBM50202514
Substrate/Competitorn/a
Meas. Tech.ChEMBL_1624520 (CHEMBL3866932)
Ki 17±n/a nM
Citation Osman, NALigresti, AKlein, CDAllarà, MRabbito, ADi Marzo, VAbouzid, KAAbadi, AH Discovery of novel Tetrahydrobenzo[b]thiophene and pyrrole based scaffolds as potent and selective CB2 receptor ligands: The structural elements controlling binding affinity, selectivity and functionality. Eur J Med Chem122:619-634 (2016) 
 
Cannabinoid receptor 2
Name:Cannabinoid receptor 2
Type:G Protein-Coupled Receptor (GPCR)
Mol. Mass.:39690.94
Organism:Homo sapiens (Human)
Description:P34972
Residue:360
BDBM50202514
NameBDBM50202514
Synonyms:CHEMBL3930225
TypeSmall organic molecule
Emp. Form.C22H21NO3S
Mol. Mass.379.472
SMILESCCOC(=O)c1c(NC(=O)c2cccc3ccccc23)sc2CCCCc12