Reaction Details
TargetCannabinoid receptor 2
LigandBDBM50202534
Substrate/Competitorn/a
Meas. Tech.ChEMBL_1624520 (CHEMBL3866932)
Ki>10000±n/a nM
Citation Osman, NALigresti, AKlein, CDAllarà, MRabbito, ADi Marzo, VAbouzid, KAAbadi, AH Discovery of novel Tetrahydrobenzo[b]thiophene and pyrrole based scaffolds as potent and selective CB2 receptor ligands: The structural elements controlling binding affinity, selectivity and functionality. Eur J Med Chem122:619-634 (2016) 
 
Cannabinoid receptor 2
Name:Cannabinoid receptor 2
Type:G Protein-Coupled Receptor (GPCR)
Mol. Mass.:39690.94
Organism:Homo sapiens (Human)
Description:P34972
Residue:360
BDBM50202534
NameBDBM50202534
Synonyms:CHEMBL3939831
TypeSmall organic molecule
Emp. Form.C33H25NO6S3
Mol. Mass.627.75
SMILESCCOC(=O)c1cc(sc1N(S(=O)(=O)c1ccc2ccccc2c1)S(=O)(=O)c1ccc2ccccc2c1)-c1ccccc1