Reaction Details
TargetCannabinoid receptor 1
LigandBDBM50202538
Substrate/Competitorn/a
Meas. Tech.ChEMBL_1624519 (CHEMBL3866931)
Ki>10000±n/a nM
Citation Osman, NALigresti, AKlein, CDAllarà, MRabbito, ADi Marzo, VAbouzid, KAAbadi, AH Discovery of novel Tetrahydrobenzo[b]thiophene and pyrrole based scaffolds as potent and selective CB2 receptor ligands: The structural elements controlling binding affinity, selectivity and functionality. Eur J Med Chem122:619-634 (2016) 
 
Cannabinoid receptor 1
Name:Cannabinoid receptor 1
Type:G Protein-Coupled Receptor (GPCR)
Mol. Mass.:52868.96
Organism:Homo sapiens (Human)
Description:P21554
Residue:472
BDBM50202538
NameBDBM50202538
Synonyms:CHEMBL1329864 | OSM-S-12
TypeSmall organic molecule
Emp. Form.C13H13NO2
Mol. Mass.215.2478
SMILESCc1cc(C(O)=O)c(C)n1-c1ccccc1