Reaction Details
TargetCytochrome P450 11B1, mitochondrial
LigandBDBM31768
Substrate/Competitorn/a
Meas. Tech.ChEMBL_1625604 (CHEMBL3868073)
IC50 116±n/a nM
Citation Blass, BEIyer, PAbou-Gharbia, MChilders, WEGordon, JCRamanjulu, MMorton, GArumugam, PBoruwa, JEllingboe, JMitra, SNimmareddy, RRPaliwal, SRajasekhar, JShivakumar, SSrivastava, PTangirala, RSVenkataramanaiah, KYanamandra, M Design, synthesis, and evaluation of (2S,4R)-Ketoconazole sulfonamide analogs as potential treatments for Metabolic Syndrome. Bioorg Med Chem Lett26:5825-5829 (2016) 
 
Cytochrome P450 11B1, mitochondrial
Name:Cytochrome P450 11B1, mitochondrial
Type:Enzyme
Mol. Mass.:57591.44
Organism:Homo sapiens (Human)
Description:P15538
Residue:503
BDBM31768
NameBDBM31768
Synonyms:CHEMBL295698 Nizoral | Panfungol
TypeSmall organic molecule
Emp. Form.C26H28Cl2N4O4
Mol. Mass.531.431
SMILESCC(=O)N1CCN(CC1)c1ccc(OC[C@@H]2CO[C@](Cn3ccnc3)(O2)c2ccc(Cl)cc2Cl)cc1