Reaction Details
TargetSteroid 21-hydroxylase
LigandBDBM50203341
Substrate/Competitorn/a
Meas. Tech.ChEMBL_1625605 (CHEMBL3868074)
IC50 148±n/a nM
Citation Blass, BEIyer, PAbou-Gharbia, MChilders, WEGordon, JCRamanjulu, MMorton, GArumugam, PBoruwa, JEllingboe, JMitra, SNimmareddy, RRPaliwal, SRajasekhar, JShivakumar, SSrivastava, PTangirala, RSVenkataramanaiah, KYanamandra, M Design, synthesis, and evaluation of (2S,4R)-Ketoconazole sulfonamide analogs as potential treatments for Metabolic Syndrome. Bioorg Med Chem Lett26:5825-5829 (2016) 
 
Steroid 21-hydroxylase
Name:Steroid 21-hydroxylase
Type:PROTEIN
Mol. Mass.:55896.25
Organism:Homo sapiens (Human)
Description:ChEMBL_1498865
Residue:494
BDBM50203341
NameBDBM50203341
Synonyms:CHEMBL3960724
TypeSmall organic molecule
Emp. Form.C28H28Cl2N4O5S2
Mol. Mass.635.582
SMILESClc1ccc(c(Cl)c1)[C@]1(Cn2ccnc2)OC[C@@H](COc2ccc(cc2)N2CCN(CC2)S(=O)(=O)c2cccs2)O1