Reaction Details
TargetGlucocorticoid receptor
LigandBDBM50203413
Substrate/Competitorn/a
Meas. Tech.ChEMBL_1625692 (CHEMBL3868161)
IC50 0.050000±n/a nM
Citation Hemmerling, MEdman, KLepistö, MEriksson, AIvanova, SDahmén, JRehwinkel, HBerger, MHendrickx, RDearman, MJensen, TJWissler, LHansson, T Discovery of indazole ethers as novel, potent, non-steroidal glucocorticoid receptor modulators. Bioorg Med Chem Lett26:5741-5748 (2016) 
 
Glucocorticoid receptor
Name:Glucocorticoid receptor
Type:Enzyme
Mol. Mass.:85656.87
Organism:Homo sapiens (Human)
Description:P04150
Residue:777
BDBM50203413
NameBDBM50203413
Synonyms:CHEMBL3920760
TypeSmall organic molecule
Emp. Form.C29H32FN3O2
Mol. Mass.473.5817
SMILESCCc1ccc(cc1)[C@@H](Oc1ccc2n(ncc2c1)-c1ccc(F)cc1)[C@H](C)NC(=O)C(C)(C)C