Reaction Details
TargetGlucocorticoid receptor
LigandBDBM50203418
Substrate/Competitorn/a
Meas. Tech.ChEMBL_1625692 (CHEMBL3868161)
IC50 0.040000±n/a nM
Citation Hemmerling, MEdman, KLepistö, MEriksson, AIvanova, SDahmén, JRehwinkel, HBerger, MHendrickx, RDearman, MJensen, TJWissler, LHansson, T Discovery of indazole ethers as novel, potent, non-steroidal glucocorticoid receptor modulators. Bioorg Med Chem Lett26:5741-5748 (2016) 
 
Glucocorticoid receptor
Name:Glucocorticoid receptor
Type:Enzyme
Mol. Mass.:85656.87
Organism:Homo sapiens (Human)
Description:P04150
Residue:777
BDBM50203418
NameBDBM50203418
Synonyms:CHEMBL3902818
TypeSmall organic molecule
Emp. Form.C28H21F4N3O2
Mol. Mass.507.4789
SMILESC[C@H](NC(=O)C(F)(F)F)[C@H](Oc1ccc2n(ncc2c1)-c1ccc(F)cc1)c1ccc2ccccc2c1