Reaction Details
TargetGlucocorticoid receptor
LigandBDBM50203428
Substrate/Competitorn/a
Meas. Tech.ChEMBL_1625692 (CHEMBL3868161)
IC50 0.660000±n/a nM
Citation Hemmerling, MEdman, KLepistö, MEriksson, AIvanova, SDahmén, JRehwinkel, HBerger, MHendrickx, RDearman, MJensen, TJWissler, LHansson, T Discovery of indazole ethers as novel, potent, non-steroidal glucocorticoid receptor modulators. Bioorg Med Chem Lett26:5741-5748 (2016) 
 
Glucocorticoid receptor
Name:Glucocorticoid receptor
Type:Enzyme
Mol. Mass.:85656.87
Organism:Homo sapiens (Human)
Description:P04150
Residue:777
BDBM50203428
NameBDBM50203428
Synonyms:CHEMBL3970276
TypeSmall organic molecule
Emp. Form.C27H28FN3O2
Mol. Mass.445.5285
SMILESC[C@H](NC(=O)C(C)(C)C)[C@H](Oc1ccc2n(ncc2c1)-c1ccc(F)cc1)c1ccccc1