Reaction Details
TargetCoiled-coil domain-containing protein 6/Proto-oncogene tyrosine-protein kinase receptor Ret
LigandBDBM50322535
Substrate/Competitorn/a
Meas. Tech.ChEMBL_1625726 (CHEMBL3868195)
IC50 180±n/a nM
Citation Han, MLi, SAi, JSheng, RHu, YHu, YGeng, M Discovery of 4-chloro-3-(5-(pyridin-3-yl)-1,2,4-oxadiazole-3-yl)benzamides as novel RET kinase inhibitors. Bioorg Med Chem Lett26:5679-5684 (2016) 
 
Coiled-coil domain-containing protein 6/Proto-oncogene tyrosine-protein kinase receptor Ret
Name:Coiled-coil domain-containing protein 6/Proto-oncogene tyrosine-protein kinase receptor Ret
Type:Protein
Mol. Mass.:n/a
Description:n/a
Components:This complex has 2 components.
Component 1
Name:Proto-oncogene tyrosine-protein kinase receptor Ret
Synonyms:CDHF12 Cadherin family member 12 Proto-oncogene c-Ret RET51 Tyrosine-protein kinase Ret (RET)
Type:Protein
Mol. Mass.:124318.29
Organism:Homo sapiens (Human)
Description:P07949
Residue:1114
Component 2
Name:Coiled-coil domain-containing protein 6
Synonyms:CCDC6 Coiled-coil domain-containing protein 6 Papillary thyroid carcinoma-encoded protein TST1
Type:PROTEIN
Mol. Mass.:53294.85
Organism:Homo sapiens (Human)
Description:ChEMBL_109661
Residue:474
BDBM50322535
NameBDBM50322535
Synonyms:3-(imidazo[1,2-b]pyridazin-3-ylethynyl)-4-methyl-N-{4-[(4-methylpiperazin-1-yl)methyl]-3-(trifluoromethyl)phenyl}benzamide CHEMBL1171837 US10464902, Ponatinib | US9255107, AP24534
TypeSmall organic molecule
Emp. Form.C29H27F3N6O
Mol. Mass.532.5595
SMILESCN1CCN(Cc2ccc(NC(=O)c3ccc(C)c(c3)C#Cc3cnc4cccnn34)cc2C(F)(F)F)CC1