Reaction Details
TargetNuclear receptor ROR-gamma
LigandBDBM50445877
Substrate/Competitorn/a
Meas. Tech.ChEMBL_1625734 (CHEMBL3868203)
IC50 80±n/a nM
Citation Ouvry, GBouix-Peter, CCiesielski, FChantalat, LChristin, OComino, CDuvert, DFeret, CHarris, CSLamy, LLuzy, APMusicki, BOrfila, DPascau, JParnet, VPerrin, APierre, RPolge, GRaffin, CRival, YTaquet, NThoreau, EHennequin, LF Discovery of phenoxyindazoles and phenylthioindazoles as ROR¿ inverse agonists. Bioorg Med Chem Lett26:5802-5808 (2016) 
 
Nuclear receptor ROR-gamma
Name:Nuclear receptor ROR-gamma
Type:Enzyme Catalytic Domain
Mol. Mass.:58218.40
Organism:Homo sapiens (Human)
Description:P51449
Residue:518
BDBM50445877
NameBDBM50445877
Synonyms:CHEMBL3105681
TypeSmall organic molecule
Emp. Form.C26H20Cl2N2O4S2
Mol. Mass.559.484
SMILESCCS(=O)(=O)c1ccc(CC(=O)Nc2nc(c(s2)C(=O)c2ccccc2Cl)-c2cccc(Cl)c2)cc1