Reaction Details
TargetOrexin receptor type 2
LigandBDBM50203726
Substrate/Competitorn/a
Meas. Tech.ChEMBL_1625870 (CHEMBL3868339)
Ki 1470±n/a nM
Citation Stump, CACooke, AJBruno, JCabalu, TDGotter, ALHarell, CMKuduk, SDMcDonald, TPO'Brien, JRenger, JJWilliams, PDWinrow, CJColeman, PJ Discovery of highly potent and selective orexin 1 receptor antagonists (1-SORAs) suitable for in vivo interrogation of orexin 1 receptor pharmacology. Bioorg Med Chem Lett26:5809-5814 (2016) 
 
Orexin receptor type 2
Name:Orexin receptor type 2
Type:Protein
Mol. Mass.:50710.53
Organism:Homo sapiens (Human)
Description:O43614
Residue:444
BDBM50203726
NameBDBM50203726
Synonyms:CHEMBL3946473
TypeSmall organic molecule
Emp. Form.C22H18F2N6O2
Mol. Mass.436.4141
SMILESFC1(F)CCN(CC1Oc1ncc2ccccc2n1)C(=O)c1ccccc1-n1nccn1