Reaction Details
TargetOrexin/Hypocretin receptor type 1
LigandBDBM50203731
Substrate/Competitorn/a
Meas. Tech.ChEMBL_1625868 (CHEMBL3868337)
IC50 16±n/a nM
Citation Stump, CACooke, AJBruno, JCabalu, TDGotter, ALHarell, CMKuduk, SDMcDonald, TPO'Brien, JRenger, JJWilliams, PDWinrow, CJColeman, PJ Discovery of highly potent and selective orexin 1 receptor antagonists (1-SORAs) suitable for in vivo interrogation of orexin 1 receptor pharmacology. Bioorg Med Chem Lett26:5809-5814 (2016) 
 
Orexin/Hypocretin receptor type 1
Name:Orexin/Hypocretin receptor type 1
Type:Protein
Mol. Mass.:46817.55
Organism:Rattus norvegicus (Rat)
Description:P56718
Residue:416
BDBM50203731
NameBDBM50203731
Synonyms:CHEMBL3973097
TypeSmall organic molecule
Emp. Form.C21H17F2N5O2
Mol. Mass.409.3888
SMILESFC1(F)CCN(C[C@@H]1Oc1ccc2ccccc2n1)C(=O)c1nccc2[nH]cnc12