Reaction Details
TargetOrexin receptor type 2
LigandBDBM50438822
Substrate/Competitorn/a
Meas. Tech.ChEMBL_1625870 (CHEMBL3868339)
Ki 417±n/a nM
Citation Stump, CACooke, AJBruno, JCabalu, TDGotter, ALHarell, CMKuduk, SDMcDonald, TPO'Brien, JRenger, JJWilliams, PDWinrow, CJColeman, PJ Discovery of highly potent and selective orexin 1 receptor antagonists (1-SORAs) suitable for in vivo interrogation of orexin 1 receptor pharmacology. Bioorg Med Chem Lett26:5809-5814 (2016) 
 
Orexin receptor type 2
Name:Orexin receptor type 2
Type:Protein
Mol. Mass.:50710.53
Organism:Homo sapiens (Human)
Description:O43614
Residue:444
BDBM50438822
NameBDBM50438822
Synonyms:CHEMBL2413367
TypeSmall organic molecule
Emp. Form.C31H38N2O5
Mol. Mass.518.6438
SMILESCOc1ccc(C[C@@H]2N(CCc3cc(OC)c(OC)cc23)[C@@H](C(=O)NC(C)C)c2ccccc2)cc1OC