Reaction Details
TargetOrexin receptor type 2
LigandBDBM50203743
Substrate/Competitorn/a
Meas. Tech.ChEMBL_1625870 (CHEMBL3868339)
Ki 220±n/a nM
Citation Stump, CACooke, AJBruno, JCabalu, TDGotter, ALHarell, CMKuduk, SDMcDonald, TPO'Brien, JRenger, JJWilliams, PDWinrow, CJColeman, PJ Discovery of highly potent and selective orexin 1 receptor antagonists (1-SORAs) suitable for in vivo interrogation of orexin 1 receptor pharmacology. Bioorg Med Chem Lett26:5809-5814 (2016) 
 
Orexin receptor type 2
Name:Orexin receptor type 2
Type:Protein
Mol. Mass.:50710.53
Organism:Homo sapiens (Human)
Description:O43614
Residue:444
BDBM50203743
NameBDBM50203743
Synonyms:CHEMBL3923070
TypeSmall organic molecule
Emp. Form.C21H17F2N5O2S
Mol. Mass.441.454
SMILESFC1(F)CCN(CC1Oc1nc2ccccc2s1)C(=O)c1ccccc1-n1nccn1