Reaction Details
TargetOrexin/Hypocretin receptor type 1
LigandBDBM50060937
Substrate/Competitorn/a
Meas. Tech.ChEMBL_1625868 (CHEMBL3868337)
IC50 11±n/a nM
Citation Stump, CACooke, AJBruno, JCabalu, TDGotter, ALHarell, CMKuduk, SDMcDonald, TPO'Brien, JRenger, JJWilliams, PDWinrow, CJColeman, PJ Discovery of highly potent and selective orexin 1 receptor antagonists (1-SORAs) suitable for in vivo interrogation of orexin 1 receptor pharmacology. Bioorg Med Chem Lett26:5809-5814 (2016) 
 
Orexin/Hypocretin receptor type 1
Name:Orexin/Hypocretin receptor type 1
Type:Protein
Mol. Mass.:46817.55
Organism:Rattus norvegicus (Rat)
Description:P56718
Residue:416
BDBM50060937
NameBDBM50060937
Synonyms:CHEMBL3394848
TypeSmall organic molecule
Emp. Form.C23H19F2N5O2
Mol. Mass.435.4261
SMILESFC1(F)CCN(C[C@@H]1Oc1ccc2ccccc2n1)C(=O)c1ccccc1-n1nccn1