Reaction Details
TargetOrexin receptor type 2
LigandBDBM50203759
Substrate/Competitorn/a
Meas. Tech.ChEMBL_1625870 (CHEMBL3868339)
Ki>5868±n/a nM
Citation Stump, CACooke, AJBruno, JCabalu, TDGotter, ALHarell, CMKuduk, SDMcDonald, TPO'Brien, JRenger, JJWilliams, PDWinrow, CJColeman, PJ Discovery of highly potent and selective orexin 1 receptor antagonists (1-SORAs) suitable for in vivo interrogation of orexin 1 receptor pharmacology. Bioorg Med Chem Lett26:5809-5814 (2016) 
 
Orexin receptor type 2
Name:Orexin receptor type 2
Type:Protein
Mol. Mass.:50710.53
Organism:Homo sapiens (Human)
Description:O43614
Residue:444
BDBM50203759
NameBDBM50203759
Synonyms:CHEMBL3911086
TypeSmall organic molecule
Emp. Form.C21H17F2N5O2
Mol. Mass.409.3888
SMILESFC1(F)CCN(CC1Oc1ccc2ccccc2n1)C(=O)c1ccnc2[nH]cnc12