Reaction Details
TargetProstaglandin G/H synthase 2
LigandBDBM85245
Substrate/Competitorn/a
Meas. Tech.ChEMBL_1627348 (CHEMBL3869869)
IC50 102800±n/a nM
Citation Swiatek, PStrzelecka, MUrniaz, RGebczak, KGebarowski, TGasiorowski, KMalinka, W Synthesis, COX-1/2 inhibition activities and molecular docking study of isothiazolopyridine derivatives. Bioorg Med Chem25:316-326 (2017) 
 
Prostaglandin G/H synthase 2
Name:Prostaglandin G/H synthase 2
Type:Enzyme
Mol. Mass.:69003.89
Organism:Homo sapiens (Human)
Description:Recombinant Cox-2 provided by Cayman (Cayman Chemical Co.,Ann Arbor, MI).
Residue:604
BDBM85245
NameBDBM85245
Synonyms:CAS_36322-90-4 Piroxicam
TypeSmall organic molecule
Emp. Form.C15H13N3O4S
Mol. Mass.331.346
SMILESCN1C(C(=O)Nc2ccccn2)=C(O)c2ccccc2S1(=O)=O