Reaction Details
TargetMetabotropic glutamate receptor 5
LigandBDBM174392
Substrate/Competitorn/a
Meas. Tech.ChEMBL_1627459 (CHEMBL3869980)
Ki 13±n/a nM
Citation Degnan, APMaxwell, DBalakrishnan, ABrown, JMEaston, AGulianello, MHanumegowda, UHill-Drzewi, MMiller, RSantone, KSSenapati, AShields, EESivarao, DVWestphal, RWhiterock, VJZhuo, XBronson, JJMacor, JE Difluorocyclobutylacetylenes as positive allosteric modulators of mGluR5 with reduced bioactivation potential. Bioorg Med Chem Lett26:5871-5876 (2016) 
 
Metabotropic glutamate receptor 5
Name:Metabotropic glutamate receptor 5
Type:Enzyme
Mol. Mass.:132484.72
Organism:Homo sapiens (Human)
Description:n/a
Residue:1212
BDBM174392
NameBDBM174392
Synonyms:US9688669, Example 124
TypeSmall organic molecule
Emp. Form.C20H14Cl2F2N2O2
Mol. Mass.423.24
SMILESFC1(F)CC(C1)C#Cc1cncc(c1)[C@H]1NC(=O)O[C@@H]1c1cccc(Cl)c1Cl