Reaction Details
TargetMetabotropic glutamate receptor 5
LigandBDBM174252
Substrate/Competitorn/a
Meas. Tech.ChEMBL_1627459 (CHEMBL3869980)
Ki 47±n/a nM
Citation Degnan, APMaxwell, DBalakrishnan, ABrown, JMEaston, AGulianello, MHanumegowda, UHill-Drzewi, MMiller, RSantone, KSSenapati, AShields, EESivarao, DVWestphal, RWhiterock, VJZhuo, XBronson, JJMacor, JE Difluorocyclobutylacetylenes as positive allosteric modulators of mGluR5 with reduced bioactivation potential. Bioorg Med Chem Lett26:5871-5876 (2016) 
 
Metabotropic glutamate receptor 5
Name:Metabotropic glutamate receptor 5
Type:Enzyme
Mol. Mass.:132484.72
Organism:Homo sapiens (Human)
Description:n/a
Residue:1212
BDBM174252
NameBDBM174252
Synonyms:US9688669, Example 83
TypeSmall organic molecule
Emp. Form.C22H21FN2O2
Mol. Mass.364.4127
SMILESFc1cccc(c1)[C@H]1OC(=O)N[C@@H]1c1cncc(c1)C#CC1CCCCC1