Reaction Details
TargetSterol O-acyltransferase 2
LigandBDBM50204548
Substrate/Competitorn/a
Meas. Tech.ChEBML_1627619
IC50>33000±n/a nM
Citation Kobayashi, KOhshiro, TTomoda, HYin, FCui, HLChouthaiwale, PVTanaka, F Discovery of SOAT2 inhibitors from synthetic small molecules. Bioorg Med Chem Lett26:5899-5901 (2016) 
 
Sterol O-acyltransferase 2
Name:Sterol O-acyltransferase 2
Type:PROTEIN
Mol. Mass.:60426.29
Organism:Chlorocebus aethiops
Description:ChEMBL_116979
Residue:526
BDBM50204548
NameBDBM50204548
Synonyms:CHEMBL3932453
TypeSmall organic molecule
Emp. Form.C23H27BrN2O2
Mol. Mass.443.377
SMILESCCC[C@@H]1C[C@H](C[C@@]2(O1)C(=O)N(C)c1cccc(Br)c21)NCc1ccccc1