Reaction Details
TargetSterol O-acyltransferase 2
LigandBDBM50204556
Substrate/Competitorn/a
Meas. Tech.ChEMBL_1627619 (CHEMBL3870140)
IC50>27000±n/a nM
Citation Kobayashi, KOhshiro, TTomoda, HYin, FCui, HLChouthaiwale, PVTanaka, F Discovery of SOAT2 inhibitors from synthetic small molecules. Bioorg Med Chem Lett26:5899-5901 (2016) 
 
Sterol O-acyltransferase 2
Name:Sterol O-acyltransferase 2
Type:PROTEIN
Mol. Mass.:60426.29
Organism:Chlorocebus aethiops
Description:ChEMBL_116979
Residue:526
BDBM50204556
NameBDBM50204556
Synonyms:CHEMBL3941429
TypeSmall organic molecule
Emp. Form.C23H28N2O2
Mol. Mass.364.4806
SMILESCCC[C@@H]1C[C@H](C[C@@]2(O1)C(=O)N(C)c1ccccc21)NCc1ccccc1