Reaction Details
TargetAlpha-galactosidase A
LigandBDBM50204610
Substrate/Competitorn/a
Meas. Tech.ChEMBL_1627785 (CHEMBL3870370)
pH7±n/a
IC50 10600±n/a nM
Commentsextracted
Citation Cheng, WCWang, JHLi, HYLu, SJHu, JMYun, WYChiu, CHYang, WBChien, YHHwu, WL Bioevaluation of sixteen ADMDP stereoisomers toward alpha-galactosidase A: Development of a new pharmacological chaperone for the treatment of Fabry disease and potential enhancement of enzyme replacement therapy efficiency. Eur J Med Chem123:14-20 (2016) 
 
Alpha-galactosidase A
Name:Alpha-galactosidase A
Type:Protein
Mol. Mass.:48760.21
Organism:Homo sapiens (Human)
Description:n/a
Residue:429
BDBM50204610
NameBDBM50204610
Synonyms:CHEMBL3908900
TypeSmall organic molecule
Emp. Form.C6H14N2O3
Mol. Mass.162.187
SMILESNC[C@@H]1N[C@H](CO)[C@H](O)[C@@H]1O