Reaction Details
TargetHistone deacetylase 1
LigandBDBM50205264
Substrate/Competitorn/a
Meas. Tech.ChEBML_1628121
IC50 0.720000±n/a nM
Citation Ding, CChen, SZhang, CHu, GZhang, WLi, LChen, YZTan, CJiang, Y Synthesis and investigation of novel 6-(1,2,3-triazol-4-yl)-4-aminoquinazolin derivatives possessing hydroxamic acid moiety for cancer therapy. Bioorg Med Chem25:27-37 (2017) 
 
Histone deacetylase 1
Name:Histone deacetylase 1
Type:Enzyme
Mol. Mass.:55090.27
Organism:Homo sapiens (Human)
Description:Q13547
Residue:482
BDBM50205264
NameBDBM50205264
Synonyms:CHEMBL3930620
TypeSmall organic molecule
Emp. Form.C23H23ClFN7O2
Mol. Mass.483.926
SMILESONC(=O)CCCCCCn1cc(nn1)-c1ccc2ncnc(Nc3cccc(Cl)c3F)c2c1