Reaction Details
TargetHigh affinity nerve growth factor receptor
LigandBDBM50142026
Substrate/Competitorn/a
Meas. Tech.ChEMBL_1628353 (CHEMBL3870938)
IC50 3.0±n/a nM
Citation Alam, MSChoi, SULee, DU Synthesis, anticancer, and docking studies of salicyl-hydrazone analogues: A novel series of small potent tropomyosin receptor kinase A inhibitors. Bioorg Med Chem25:389-396 (2017) 
 
High affinity nerve growth factor receptor
Name:High affinity nerve growth factor receptor
Type:n/a
Mol. Mass.:87498.18
Organism:Homo sapiens (Human)
Description:P04629
Residue:796
BDBM50142026
NameBDBM50142026
Synonyms:3-((1-methyl-1H-indol-3-yl)methylene)-1H-pyrrolo[3,2-b]pyridin-2(3H)-one CHEMBL176544
TypeSmall organic molecule
Emp. Form.C17H13N3O
Mol. Mass.275.3046
SMILESCn1cc(\C=C2/C(=O)Nc3cccnc23)c2ccccc12