Reaction Details
TargetHistone-lysine N-methyltransferase EZH2
LigandBDBM50205626
Substrate/Competitorn/a
Meas. Tech.ChEMBL_1628509 (CHEMBL3871094)
IC50 2150±n/a nM
Citation Ansari, ASatalkar, SPatil, VShete, ASKaur, SGupta, ASingh, SRaja, MSeverance, DLBernales, SChakravarty, SHung, DTPham, SMHerrera, FJRai, R Novel 3-methylindoline inhibitors of EZH2: Design, synthesis and SAR. Bioorg Med Chem Lett27:217-222 (2017) 
 
Histone-lysine N-methyltransferase EZH2
Name:Histone-lysine N-methyltransferase EZH2
Type:Protein
Mol. Mass.:85367.84
Organism:Homo sapiens (Human)
Description:Q15910
Residue:746
BDBM50205626
NameBDBM50205626
Synonyms:CHEMBL3900506
TypeSmall organic molecule
Emp. Form.C32H40N6O3
Mol. Mass.556.6984
SMILESCC1CN(C2CCOCC2)c2cc(cc(C(=O)NCc3c(C)cc(C)[nH]c3=O)c12)-c1ccc(nc1)N1CCNCC1