Reaction Details
TargetHistone-lysine N-methyltransferase EZH2
LigandBDBM50205628
Substrate/Competitorn/a
Meas. Tech.ChEMBL_1628509 (CHEMBL3871094)
IC50 88±n/a nM
Citation Ansari, ASatalkar, SPatil, VShete, ASKaur, SGupta, ASingh, SRaja, MSeverance, DLBernales, SChakravarty, SHung, DTPham, SMHerrera, FJRai, R Novel 3-methylindoline inhibitors of EZH2: Design, synthesis and SAR. Bioorg Med Chem Lett27:217-222 (2017) 
 
Histone-lysine N-methyltransferase EZH2
Name:Histone-lysine N-methyltransferase EZH2
Type:Protein
Mol. Mass.:85367.84
Organism:Homo sapiens (Human)
Description:Q15910
Residue:746
BDBM50205628
NameBDBM50205628
Synonyms:CHEMBL3906288
TypeSmall organic molecule
Emp. Form.C22H26N4O2
Mol. Mass.378.4674
SMILESCC(C)N1CC(C)c2c1cc(cc2C(=O)NCc1c(C)cc(C)[nH]c1=O)C#N