Reaction Details
TargetHistone-lysine N-methyltransferase EZH1
LigandBDBM50205628
Substrate/Competitorn/a
Meas. Tech.ChEMBL_1628507 (CHEMBL3871092)
IC50 7750±n/a nM
Citation Ansari, ASatalkar, SPatil, VShete, ASKaur, SGupta, ASingh, SRaja, MSeverance, DLBernales, SChakravarty, SHung, DTPham, SMHerrera, FJRai, R Novel 3-methylindoline inhibitors of EZH2: Design, synthesis and SAR. Bioorg Med Chem Lett27:217-222 (2017) 
 
Histone-lysine N-methyltransferase EZH1
Name:Histone-lysine N-methyltransferase EZH1
Type:Protein
Mol. Mass.:85285.34
Organism:Homo sapiens (Human)
Description:Q92800
Residue:747
BDBM50205628
NameBDBM50205628
Synonyms:CHEMBL3906288
TypeSmall organic molecule
Emp. Form.C22H26N4O2
Mol. Mass.378.4674
SMILESCC(C)N1CC(C)c2c1cc(cc2C(=O)NCc1c(C)cc(C)[nH]c1=O)C#N