Reaction Details
TargetTyrosinase
LigandBDBM50205815
Substrate/Competitorn/a
Meas. Tech.ChEMBL_1628554 (CHEMBL3871139)
Ki 1020±n/a nM
Citation Haudecoeur, RCarotti, MGouron, AMaresca, MBuitrago, EHardré, RBergantino, EJamet, HBelle, CRéglier, MBubacco, LBoumendjel, A 2-Hydroxypyridine- ACS Med Chem Lett8:55-60 (2017) 
 
Tyrosinase
Name:Tyrosinase
Type:Protein
Mol. Mass.:60388.08
Organism:Homo sapiens (Human)
Description:P14679
Residue:529
BDBM50205815
NameBDBM50205815
Synonyms:CHEMBL3907670
TypeSmall organic molecule
Emp. Form.C14H9NO5
Mol. Mass.271.225
SMILESOc1cccc2O\C(=C/c3ccc(=O)n(O)c3)C(=O)c12