Reaction Details
TargetTyrosinase
LigandBDBM50205814
Substrate/Competitorn/a
Meas. Tech.ChEMBL_1628554 (CHEMBL3871139)
Ki 128000±n/a nM
Citation Haudecoeur, RCarotti, MGouron, AMaresca, MBuitrago, EHardré, RBergantino, EJamet, HBelle, CRéglier, MBubacco, LBoumendjel, A 2-Hydroxypyridine- ACS Med Chem Lett8:55-60 (2017) 
 
Tyrosinase
Name:Tyrosinase
Type:Protein
Mol. Mass.:60388.08
Organism:Homo sapiens (Human)
Description:P14679
Residue:529
BDBM50205814
NameBDBM50205814
Synonyms:CHEMBL3898657
TypeSmall organic molecule
Emp. Form.C5H5NO2
Mol. Mass.111.0987
SMILESOc1cccc[n+]1[O-]