Reaction Details
TargetTyrosinase
LigandBDBM50205806
Substrate/Competitorn/a
Meas. Tech.ChEMBL_1628554 (CHEMBL3871139)
Ki 1200±n/a nM
Citation Haudecoeur, RCarotti, MGouron, AMaresca, MBuitrago, EHardré, RBergantino, EJamet, HBelle, CRéglier, MBubacco, LBoumendjel, A 2-Hydroxypyridine- ACS Med Chem Lett8:55-60 (2017) 
 
Tyrosinase
Name:Tyrosinase
Type:Protein
Mol. Mass.:60388.08
Organism:Homo sapiens (Human)
Description:P14679
Residue:529
BDBM50205806
NameBDBM50205806
Synonyms:CHEMBL3969839
TypeSmall organic molecule
Emp. Form.C14H9NO6
Mol. Mass.287.2244
SMILESOc1cc2O\C(=C/c3ccc(=O)n(O)c3)C(=O)c2c(O)c1