Reaction Details
TargetTyrosinase
LigandBDBM50031467
Substrate/Competitorn/a
Meas. Tech.ChEMBL_1628554 (CHEMBL3871139)
Ki 350000±n/a nM
Citation Haudecoeur, RCarotti, MGouron, AMaresca, MBuitrago, EHardré, RBergantino, EJamet, HBelle, CRéglier, MBubacco, LBoumendjel, A 2-Hydroxypyridine- ACS Med Chem Lett8:55-60 (2017) 
 
Tyrosinase
Name:Tyrosinase
Type:Protein
Mol. Mass.:60388.08
Organism:Homo sapiens (Human)
Description:P14679
Residue:529
BDBM50031467
NameBDBM50031467
Synonyms:5-HYDROXY-2-(HYDROXYMETHYL)-4H-PYRAN-4-ONE CHEMBL287556 US10857082, Kojic acid US9682910, kojic acid
TypeSmall organic molecule
Emp. Form.C6H6O4
Mol. Mass.142.1094
SMILESOCc1cc(=O)c(O)co1