Reaction Details
TargetTyrosine-protein phosphatase non-receptor type 1
LigandBDBM50206287
Substrate/Competitorn/a
Meas. Tech.ChEMBL_1628658 (CHEMBL3871243)
Ki 4500±n/a nM
Citation Basu, SPrathipati, PThorat, SAnsari, SPatel, MJain, VJinugu, RRNiranjan, SDe, SReddy, S Rational design, synthesis, and structure-activity relationships of 5-amino-1H-pyrazole-4-carboxylic acid derivatives as protein tyrosine phosphatase 1B inhibitors. Bioorg Med Chem25:67-74 (2017) 
 
Tyrosine-protein phosphatase non-receptor type 1
Name:Tyrosine-protein phosphatase non-receptor type 1
Type:Protein phosphatase
Mol. Mass.:49963.76
Organism:Homo sapiens (Human)
Description:Human recombinant GST-fusion PTP1B (1-435).
Residue:435
BDBM50206287
NameBDBM50206287
Synonyms:CHEMBL3943399
TypeSmall organic molecule
Emp. Form.C25H22ClFN4O2
Mol. Mass.464.919
SMILESNc1c(cnn1-c1ccc(CN(Cc2ccc(F)cc2)Cc2ccc(Cl)cc2)cc1)C(O)=O