Reaction Details
TargetTyrosine-protein phosphatase non-receptor type 1
LigandBDBM50206291
Substrate/Competitorn/a
Meas. Tech.ChEMBL_1628658 (CHEMBL3871243)
Ki 4600±n/a nM
Citation Basu, SPrathipati, PThorat, SAnsari, SPatel, MJain, VJinugu, RRNiranjan, SDe, SReddy, S Rational design, synthesis, and structure-activity relationships of 5-amino-1H-pyrazole-4-carboxylic acid derivatives as protein tyrosine phosphatase 1B inhibitors. Bioorg Med Chem25:67-74 (2017) 
 
Tyrosine-protein phosphatase non-receptor type 1
Name:Tyrosine-protein phosphatase non-receptor type 1
Type:Protein phosphatase
Mol. Mass.:49963.76
Organism:Homo sapiens (Human)
Description:Human recombinant GST-fusion PTP1B (1-435).
Residue:435
BDBM50206291
NameBDBM50206291
Synonyms:CHEMBL3975747
TypeSmall organic molecule
Emp. Form.C26H19ClFN5O3
Mol. Mass.503.912
SMILESNc1c(cnn1-c1ccc(CC(c2nc(no2)-c2ccc(Cl)cc2)c2ccc(F)cc2)cc1)C(O)=O