Reaction Details
TargetTyrosine-protein phosphatase non-receptor type 1
LigandBDBM50206294
Substrate/Competitorn/a
Meas. Tech.ChEMBL_1628658 (CHEMBL3871243)
Ki 8600±n/a nM
Citation Basu, SPrathipati, PThorat, SAnsari, SPatel, MJain, VJinugu, RRNiranjan, SDe, SReddy, S Rational design, synthesis, and structure-activity relationships of 5-amino-1H-pyrazole-4-carboxylic acid derivatives as protein tyrosine phosphatase 1B inhibitors. Bioorg Med Chem25:67-74 (2017) 
 
Tyrosine-protein phosphatase non-receptor type 1
Name:Tyrosine-protein phosphatase non-receptor type 1
Type:Protein phosphatase
Mol. Mass.:49963.76
Organism:Homo sapiens (Human)
Description:Human recombinant GST-fusion PTP1B (1-435).
Residue:435
BDBM50206294
NameBDBM50206294
Synonyms:CHEMBL3960817
TypeSmall organic molecule
Emp. Form.C27H22FN5O4
Mol. Mass.499.4931
SMILESCOc1ccc(cc1)C(Cc1ccc(cc1)-n1ncc(C(O)=O)c1N)c1nc(no1)-c1cccc(F)c1