Reaction Details
TargetTyrosine-protein phosphatase non-receptor type 1
LigandBDBM50206295
Substrate/Competitorn/a
Meas. Tech.ChEMBL_1628658 (CHEMBL3871243)
Ki 7100±n/a nM
Citation Basu, SPrathipati, PThorat, SAnsari, SPatel, MJain, VJinugu, RRNiranjan, SDe, SReddy, S Rational design, synthesis, and structure-activity relationships of 5-amino-1H-pyrazole-4-carboxylic acid derivatives as protein tyrosine phosphatase 1B inhibitors. Bioorg Med Chem25:67-74 (2017) 
 
Tyrosine-protein phosphatase non-receptor type 1
Name:Tyrosine-protein phosphatase non-receptor type 1
Type:Protein phosphatase
Mol. Mass.:49963.76
Organism:Homo sapiens (Human)
Description:Human recombinant GST-fusion PTP1B (1-435).
Residue:435
BDBM50206295
NameBDBM50206295
Synonyms:CHEMBL3961924
TypeSmall organic molecule
Emp. Form.C27H28N4O4
Mol. Mass.472.5356
SMILESCOc1ccc(CN(Cc2ccc(OC)cc2)Cc2ccc(cc2)-n2ncc(C(O)=O)c2N)cc1